{"text_format":"3","workbook":"xlsx","n_sheets":13,"sheets":["Splash","Menu","Share Price Input","FATBOY Sliders","10 Yr Focus","Conceptural Guidance","Procedural Help","Perspective","Calculations","FTSE Fourier","FFT Instructions","Version","Sheet1"],"not_rendered":{"charts":8,"images":20,"macros":1,"defined_names":10,"comments":1},"read":"whole","date_system":"1900"}

{"sheet":"Splash","index":0,"n_rows":25,"n_cols":15,"rows_kept":25,"merged":[[11,6,11,9],[12,2,12,13],[13,2,13,13],[14,7,14,8],[16,4,22,11]]}
[]
[]
[]
[]
[null,null,"Available FREE from  www.EXCELinBusiness.co.uk"]
[]
[]
[]
[]
[]
[]
[{"$nulls":6},"The Share Price"]
[null,null,"Fourier Analysis Transform"]
[null,null," Basic Operating System"]
[{"$nulls":7},"( FATBOY )"]
[]
[{"$nulls":4},"The  FATBOY enables you to analyse share price over several years and attempts to predict the share price over the next few months.    Just follow the menu-flow diagram. \nFirst, input the share price over as much time as possible, then adjust the sliders on the FATBOY screen to match the current  chart and, when the best match has been found, review the chart (found on the 10 Yr Focus tab) and carefully consider your investment strategy.  \n  \nAll the best from - The FATBOY Team "]
{"$rows_empty":7}
[null,null,"A member of BTecNet(UK)",{"$nulls":10},{"$f":"Version!I24","v":"Version:"},{"$f":"Version!J24","v":"2020v12"}]

{"sheet":"Menu","index":1,"n_rows":34,"n_cols":14,"rows_kept":34}
{"$rows_empty":33}
[null,"Member of BTecNet(UK)",{"$nulls":10},{"$f":"Version!I24","v":"Version:"},{"$f":"Version!J24","v":"2020v12"}]

{"sheet":"Share Price Input","index":2,"n_rows":506,"n_cols":9,"rows_kept":506,"merged":[[6,2,6,9]]}
[]
[]
[]
[]
[{"$nulls":5},"          Share Price Data Entry "]
[]
[null,null,"Delete all the date in the white  'Share Price' column.  Then enter share price DATA of interest remembering to \nmatch the DATE as best as possible. (The more data the better, over 10 years is recommended)\nUse the Data Multiplier to ensure the maximum data-point value is under 10,000 "]
[]
[{"$nulls":4},"DATE",null,"SHARE PRICE","Data Multiplier"]
[{"$nulls":4},"DD/MM/YYYY",null,"NMBR",1]
[{"$nulls":7},"Data-Point"]
[{"$nulls":4},"1990-10-01",null,2006,{"$f":"G12*$H$10","v":2006}]
[{"$nulls":4},"1990-11-01",null,2050,2050]
[{"$nulls":4},"1990-12-01",null,2149,2149]
[{"$nulls":4},"1991-01-01",null,2144,2144]
[{"$nulls":4},"1991-02-01",null,2177,2177]
[{"$nulls":4},"1991-03-01",null,2381,2381," "]
[{"$nulls":4},"1991-04-01",null,2457,2457]
[{"$nulls":4},"1991-05-01",null,2486,2486]
[{"$nulls":4},"1991-06-01",null,2500,2500]
{"$rows_left_out":487}
{"sheet":"FATBOY Sliders","index":3,"n_rows":84,"n_cols":19,"rows_kept":84,"merged":[[20,3,20,17],[35,3,35,17],[43,1,46,2],[48,1,51,2],[53,1,56,2],[58,1,61,2],[63,1,65,2],[67,1,69,2],[71,1,73,2]]}
[" "]
[" "," "]
[" "," "]
[" "]
{"$rows_empty":16}
[{"$nulls":3},"Change the  Amplitude, Frequency & the Phase of the individual sine waves by typing in the WHITE cells below and/or by using the sliders below."]
{"$rows_empty":7}
[" "]
[]
[]
[{"$nulls":4},1,2,3,4,5,6,7,8,9,10,11,12,13,14]
[{"$nulls":3},"Amplitude",5000,33000,4327,5000,11827,15000,6635,5000,5000,5000,5000,5000,5000,2885]
[{"$nulls":3},"Frequency",0,2658,92308,0,2654,14227,13408,0,0,0,0,0,0,20770]
[{"$nulls":3},"Phase",180,180,180,180,185,215,180,180,180,180,180,180,180,240]
[{"$nulls":3},"Change the  Amplitude, Frequency & the Phase by typing in the white cells above or by using the sliders above."]
[]
[]
[]
[]
[null,null," "]
{"$rows_left_out":44}
{"sheet":"10 Yr Focus","index":4,"n_rows":2,"n_cols":2,"rows_kept":2}
[" "]
[null," "]

{"sheet":"Conceptural Guidance","index":5,"n_rows":28,"n_cols":13,"rows_kept":28}
[]
[]
[]
[{"$nulls":6},"Conceptural Guidance to FATBOY"]
[]
[]
[]
[null,null,"The FTSE Index, also called FTSE 100  or, informally, the 'footsie', is a share index of the 100 most highly capitalised UK  companies listed on"]
[null,null," the London Stock Exchange."]
[]
[null,null,"The index is maintained by the FTSE Group, an independent company jointly owned by the Financial Times and the London Stock Exchange. "]
[null,null," Its name derives from the acronym of its two parent companies, but has since been registered as a limited company in its own right."]
[null,null,"The index began on 3rd January 1984 with a base level of 1000; the highest value reached to date is 6950.6, on 30 December 1999. After falling dramatically "]
[null,null,"during the financial crisis of 2007-2010 to a low of below 3,500 in March 2009, the index has recovered since then by a significant margin to its curent level."]
[]
[null,null,"It is the most widely used of the FTSE Group's indices, and is frequently reported (e.g. on UK news bulletins) as a measure of business prosperity."]
[null,null,"The FTSE rises and falls reflecting the state of the share of the top 100 companies. Knowing what the FTSE will do next can be very benificial."]
[]
[null,null,"FATBOY (the: Fourier Transform Basic Operating sYstem- this spreadsheet) when combined with skill and judgement, facilates a "]
[null,null,"mathematical assisted prediction (extrapolation) of the FTSE or any other collection of Share Price information."]
{"$rows_left_out":9}
{"sheet":"Procedural Help","index":6,"n_rows":77,"n_cols":5,"rows_kept":77}
{"$rows_empty":33}
[{"$nulls":4}," "]
{"$rows_empty":16}
[{"$nulls":3},"One method for trying to match the red line to the blue line is as follows:"]
[]
[{"$nulls":3},"1. First, Delete all the data in the Share Price sheet and enter as much Share Price data as possible making sure you match the Dates "]
[]
[{"$nulls":3},"2. Now to start trying to predict going-forward, Reset all Slider data by Clicking one of the 'Top' Yellow buttons on the Slider screen."]
[]
[{"$nulls":3},"3. Now start at Slider one and set the Amplitude to nearly half level. "]
[]
[{"$nulls":3},"4. Then, and do this slowly, adjust the Frequency to give a basic match. "]
[]
[{"$nulls":3},"5. The re-adjust the amplitude value, then do the same to Slider 2 &  adjust the amplitude sliders of all the sine waves to obtain a better match."]
[]
[{"$nulls":3},"6. Then change the phase of the sine waves to obtain a best-fit."]
[]
[{"$nulls":3},"7. Now comes the tricky bit."]
[{"$nulls":3},"       Identify the worst part of the red line, the part that fits the worst and"]
[{"$nulls":3},"       identify the sine wave that has a major contribution to that poor fit"]
{"$rows_left_out":11}
{"sheet":"Perspective","index":7,"n_rows":0,"n_cols":0,"rows_kept":0}

{"sheet":"Calculations","index":8,"n_rows":505,"n_cols":22,"rows_kept":505,"merged":[[1,2,1,20]]}
[{"$nulls":6},"Calculations Tab"]
[" "," ","No User Input on this page"]
[{"$nulls":3},1,2,3,4,5,6,7,8,9,10,11,12,13,14]
[null,null,"Volume",{"$f":"IF(D6>0,D5,0)","v":0},1650,216.35,0,591.35,750,331.75,0,0,0,0,0,0,144.25,{"$nulls":3},{"$f":"SUM(D4:S4)","v":3683.7}]
[null,"0-1","M or Amplitude",{"$f":"'FATBOY Sliders'!E45","v":250},{"$f":"'FATBOY Sliders'!F45","v":1650},{"$f":"'FATBOY Sliders'!G45","v":216.35},{"$f":"'FATBOY Sliders'!H45","v":250},{"$f":"'FATBOY Sliders'!I45","v":591.35},{"$f":"'FATBOY Sliders'!J45","v":750},{"$f":"'FATBOY Sliders'!K45","v":331.75},{"$f":"'FATBOY Sliders'!L45","v":250},{"$f":"'FATBOY Sliders'!M45","v":250},{"$f":"'FATBOY Sliders'!N45","v":250},{"$f":"'FATBOY Sliders'!O45","v":250},{"$f":"'FATBOY Sliders'!P45","v":250},{"$f":"'FATBOY Sliders'!Q45","v":250},{"$f":"'FATBOY Sliders'!R45","v":144.25},{"$f":"'FATBOY Sliders'!S45","v":0},null,null,{"$f":"U4*0.000001","v":0.0036837}]
[null,null,"Frequency",{"$f":"'FATBOY Sliders'!E46","v":0},{"$f":"'FATBOY Sliders'!F46","v":0.02658},{"$f":"'FATBOY Sliders'!G46","v":0.92308},{"$f":"'FATBOY Sliders'!H46","v":0},{"$f":"'FATBOY Sliders'!I46","v":0.05308},{"$f":"'FATBOY Sliders'!J46","v":0.28454},{"$f":"'FATBOY Sliders'!K46","v":0.26816},{"$f":"'FATBOY Sliders'!L46","v":0},{"$f":"'FATBOY Sliders'!M46","v":0},{"$f":"'FATBOY Sliders'!N46","v":0},{"$f":"'FATBOY Sliders'!O46","v":0},{"$f":"'FATBOY Sliders'!P46","v":0},{"$f":"'FATBOY Sliders'!Q46","v":0},{"$f":"'FATBOY Sliders'!R46","v":2.967142857142857},{"$f":"'FATBOY Sliders'!S46","v":0}]
[null,"0-360","Phase",{"$f":"'FATBOY Sliders'!E47","v":180},{"$f":"'FATBOY Sliders'!F47","v":180},{"$f":"'FATBOY Sliders'!G47","v":180},{"$f":"'FATBOY Sliders'!H47","v":180},{"$f":"'FATBOY Sliders'!I47","v":185},{"$f":"'FATBOY Sliders'!J47","v":215},{"$f":"'FATBOY Sliders'!K47","v":180},{"$f":"'FATBOY Sliders'!L47","v":180},{"$f":"'FATBOY Sliders'!M47","v":180},{"$f":"'FATBOY Sliders'!N47","v":180},{"$f":"'FATBOY Sliders'!O47","v":180},{"$f":"'FATBOY Sliders'!P47","v":180},{"$f":"'FATBOY Sliders'!Q47","v":180},{"$f":"'FATBOY Sliders'!R47","v":240},{"$f":"'FATBOY Sliders'!S47","v":0}]
[null,null," +C",{"$f":"IF(D6>0,D5*1.414,0)","v":0},{"$f":"IF(E6>0,E5*1.414,0)","v":2333.1},{"$f":"IF(F6>0,F5*1.414,0)","v":305.91889999999995},0,836.1689,1060.5,469.0945,0,0,0,0,0,0,203.96949999999998,0]
[{"$nulls":19},"Formulate\nchart","Forcast\nchart"]
["Month","Days","Degrees","A1","B2","C3","D4","E5","F6","G7","H8","J9","K10","L11","M12","N13","P14","FTSE","Q-ToDay","Form ","ForcasT"]
[10,"1990-10-01",0,{"$f":"(SIN(($C11*PI()/180*D$6+D$7*PI()/180))*D$5)+D$5","v":250.00000000000003},{"$f":"(SIN(($C11*PI()/180*E$6+E$7*PI()/180))*E$5)+E$5","v":1650.0000000000002},216.35000000000002,250.00000000000003,539.8104515261725,319.8176727367156,331.75000000000006,250.00000000000003,250.00000000000003,250.00000000000003,250.00000000000003,250.00000000000003,250.00000000000003,19.32583550409477,{"$f":"IF('Share Price Input'!H12>1,'Share Price Input'!H12,NA())","v":2006},{"$f":"IF(R11>0,0,R10)","v":0},{"$f":"IF(R11>0,U11,0)","v":5077.050276066983},{"$f":"SUM(D11:Q11)-$U$5","v":5077.050276066983},{"$f":"U11-$U$5","v":5077.0465923669835}]
[11,"1990-11-01",{"$f":"C11+360/12","v":30},250.00000000000003,1627.0372697905368,115.80683309773647,250.00000000000003,523.4598364503511,233.3904476498791,285.32246452352433,250.00000000000003,250.00000000000003,250.00000000000003,250.00000000000003,250.00000000000003,250.00000000000003,69.9865890959912,{"$f":"IF('Share Price Input'!H13>1,'Share Price Input'!H13,NA())","v":2050},0,{"$f":"IF(R12>0,U12,0)","v":4854.999756908019},{"$f":"SUM(D12:Q12)-$U$5","v":4854.999756908019},4854.996073208019]
[12,"1990-12-01",{"$f":"C12+360/12","v":60},250.00000000000003,1604.0789871604857,38.297044610446704,250.00000000000003,507.16165839088717,158.40893592439886,239.80872085664225,250.00000000000003,250.00000000000003,250.00000000000003,250.00000000000003,250.00000000000003,250.00000000000003,266.61904107579096,{"$f":"IF('Share Price Input'!H14>1,'Share Price Input'!H14,NA())","v":2149},0,4814.370704318652,4814.370704318652,4814.3670206186525]
[1,"1991-01-01",90,250.00000000000003,1581.1295988278218,1.5773090501619151,250.00000000000003,490.9285057373914,96.53438615064033,196.1045754590316,250.00000000000003,250.00000000000003,250.00000000000003,250.00000000000003,250.00000000000003,250.00000000000003,222.72366732697085,{"$f":"IF('Share Price Input'!H15>1,'Share Price Input'!H15,NA())","v":2144},0,4588.994358852018,4588.994358852018,4588.990675152018]
[2,"1991-02-01",120,250.00000000000003,1558.193549787811,14.059730297397124,250.00000000000003,474.77291665514025,49.13765637381789,155.07021808015364,250.00000000000003,250.00000000000003,250.00000000000003,250.00000000000003,250.00000000000003,250.00000000000003,24.580941362513443,{"$f":"IF('Share Price Input'!H16>1,'Share Price Input'!H16,NA())","v":2177},0,4275.811328856834,4275.811328856834,4275.807645156834]
[3,"1991-03-01",150,250.00000000000003,1535.2752824520735,72.88471738261234,250.00000000000003,458.7073694008453,17.268842127053063,117.51329141092313,250.00000000000003,250.00000000000003,250.00000000000003,250.00000000000003,250.00000000000003,250.00000000000003,61.65897244589239,{"$f":"IF('Share Price Input'!H17>1,'Share Price Input'!H17,NA())","v":2381},0,4263.304791519401,4263.304791519401,4263.301107819401]
[4,"1991-04-01",180,250.00000000000003,1512.3792357881464,164.5760865975021,250.00000000000003,442.74427268469555,1.6340110999107083,84.17299497230641,250.00000000000003,250.00000000000003,250.00000000000003,250.00000000000003,250.00000000000003,250.00000000000003,261.0774133881513,{"$f":"IF('Share Price Input'!H18>1,'Share Price Input'!H18,NA())","v":2457},0,4466.580330830713,4466.580330830713,4466.576647130713]
[5,"1991-05-01",210,250.00000000000003,1489.5098444597152,268.1283129562997,250.00000000000003,426.89595608611535,2.5795598961232145,55.70553610984433,250.00000000000003,250.00000000000003,250.00000000000003,250.00000000000003,250.00000000000003,250.00000000000003,230.86061750325894,{"$f":"IF('Share Price Input'!H19>1,'Share Price Input'!H19,NA())","v":2486},0,4473.676143311357,4473.676143311357,4473.672459611357]
[6,"1991-06-01",240,250.00000000000003,1466.6715379676757,359.8186742798457,250.00000000000003,411.1746605306421,20.0845394634689,32.67121444921145,250.00000000000003,250.00000000000003,250.00000000000003,250.00000000000003,250.00000000000003,250.00000000000003,30.402530766301595,{"$f":"IF('Share Price Input'!H20>1,'Share Price Input'!H20,NA())","v":2500},0,4320.819473757146,4320.819473757146,4320.815790057146]
[7,"1991-07-01",270,250.00000000000003,1443.8687397922001,418.64187647964354,250.00000000000003,395.59252883527705,53.76111922929772,15.523394017962175,250.00000000000003,250.00000000000003,250.00000000000003,250.00000000000003,250.00000000000003,250.00000000000003,53.722321168440914,{"$f":"IF('Share Price Input'!H21>1,'Share Price Input'!H21,NA())","v":2415},0,4381.106295822822,4381.106295822822,4381.102612122822]
{"$rows_left_out":486}
{"sheet":"FTSE Fourier","index":9,"n_rows":408,"n_cols":16,"rows_kept":408,"merged":[[10,9,10,10]]}
[]
[null,null,"FTSE","manual data",null,"       NO USER INPUT ON THIS PAGE",null,null,"(UNLESS YOU WANT TO!)"]
[" ",null,null,"21 year","fs",12,"sample frequncy, samples /year","10 year","fs",12,"sample frequncy, samples /year"]
[{"$nulls":3},"21 year","sa",256,"so max plot =128 here as max plot= sa/2","10 year","sa",128,"so max plot = 64 here as max plot= sa/2"]
[]
[null,null,"http://www.williamburrows.com/(X(1)A(oEK292LezAEkAAAAYmE2MWJkMjYtOWNlMi00ZTU2LTk3MjMtNzM4YTJlOWM5MWRlCoJByXFtggs-mwjZQcmldNXI41U1))/charts/annuity10k.aspx?AspxAutoDetectCookieSupport=1"]
[]
[null,null,"a","b","c","d","e"]
[null,null,"FTSE","manual data","plot","plot",null," ",null,"21 year"]
[{"$nulls":4},"freq = samples/year","magnitude","complex"," "]
[{"$nulls":5},"Amplitude",{"$nulls":3},"Data for scatter chart"]
[null,null,"time","data","FFT","magnitude","complex",null,null,"FFT","Magnitude"]
[null,0,"1990-10-01",2006,0,{"$f":"2/$F$4 *IMABS( G13)","v":9222.0703125},"1180425",null,null,0.046875,1145.4908771527544]
[null,1,"1990-11-01",2050,{"$f":"B14*($F$3/$F$4)","v":0.046875},1145.4908771527544,"-109634.208857388+97358.0771827353i",null,null,0.09375,1130.7292022401482]
[null,2,"1990-12-01",2149,{"$f":"B15*($F$3/$F$4)","v":0.09375},1130.7292022401482,"-14968.9524908704+143957.17959575i",null,null,0.140625,352.9388156219628]
[null,3,"1991-01-01",2144,{"$f":"B16*($F$3/$F$4)","v":0.140625},352.9388156219628,"-16458.5497046154-42071.3956613129i",null,null,0.1875,446.7297548246092]
[null,4,"1991-02-01",2177,0.1875,446.7297548246092,"18989.8035410148+53936.0811791224i",null,null,0.234375,338.3608970717209]
[null,5,"1991-03-01",2381,0.234375,338.3608970717209,"-6008.01787416384+42891.4524936939i",null,null,0.28125,382.2050927659241]
[null,6,"1991-04-01",2457,0.28125,382.2050927659241,"-12121.6742819352+47396.7482115547i",null,null,0.328125,297.39013082641856]
[null,7,"1991-05-01",2486,0.328125,297.39013082641856,"-34054.90185547+17008.2097808132i",null,null,0.375,187.4279607276995]
{"$rows_left_out":389}
{"sheet":"FFT Instructions","index":10,"n_rows":38,"n_cols":5,"rows_kept":38,"merged":[[19,4,19,11],[21,4,21,11],[26,4,26,11],[30,4,30,11],[31,4,31,11],[32,4,32,11],[36,4,36,11],[37,4,37,11]]}
[]
[{"$nulls":3},"Instructions on how to re-run the FFT (if you want to that is)"]
[null,null,"If you need this you must be keen! - best of luck . . . Andrew WS Ainger  2020"]
[null,null,"(This is just so that you can run other financial paramaters other than the FTSE ( eg: DOW) etc if you want."]
[]
[]
[null,null,1,"Label five columns in EXCEL as follows: Time, Data, FFT freq, FFT mag, FFT complex."]
[]
[{"$nulls":4},"Import Data, determine sampling frequency, adjust number of samples to 2n"]
[]
[]
[null,null,2,"Determine the sampling frequency, fs by dividing number of data, D, by the time interval, t."]
[]
[null,null,3,"we must operate on either 64 data points, 128 data points . . . 1024 data points (210), 2048 data points (211) or any other power of two."]
[]
[null,null,4,"then let sa = 518. Generally, the larger sa is, the better the accuracy"]
[]
[null,null,5,"Fill in Column E called “FFT complex”"]
[]
[{"$nulls":4},"Using Tools > Data Analysis > Fourier Analysis, enter the Input Range of the Data."]
{"$rows_left_out":19}
{"sheet":"Version","index":11,"n_rows":32,"n_cols":15,"rows_kept":32,"merged":[[16,4,16,6]]}
{"$rows_empty":7}
[{"$nulls":6},"FATBOY Version Information"]
[]
[]
[]
[]
[]
[{"$nulls":4},"This microsoft Excel spreadsheet has progressed through many versions. Please make sure you use the latest"]
[{"$nulls":4},"version, after all, it's FREE and downloadable from the EBIT page on the website:"]
[]
[{"$nulls":4},"www.excelinbusiness.co.uk"]
[]
[]
[]
[]
[]
[]
[{"$nulls":8},"Version:","2020v12"]
[]
[{"$nulls":8},"                      Now includes updated menu, Share Price input and Multiplication factor."]
{"$rows_left_out":7}
{"sheet":"Sheet1","index":12,"n_rows":0,"n_cols":0,"rows_kept":0}